Results for 4.4.0 20090130 (experimental) [trunk revision 143810] (GCC) testsuite on mips-unknown-rtems4.10

Joel Sherrill <joel.sherrill@rtems.org> joel at rtems.org
Sat Jan 31 09:34:39 CST 2009


LAST_UPDATED: Fri Jan 30 22:45:03 UTC 2009 (revision 143810)

Target is mips-unknown-rtems4.10
Host   is x86_64-unknown-linux-gnu

		=== gcc tests ===


Running target rtems-mips-jmr3904
FAIL: gcc.c-torture/execute/ieee/20000320-1.c execution,  -O0 
FAIL: gcc.c-torture/execute/ieee/20000320-1.c execution,  -O1 
FAIL: gcc.c-torture/execute/ieee/mul-subnormal-single-1.c execution,  -O0 
FAIL: gcc.c-torture/execute/ieee/mul-subnormal-single-1.c execution,  -O1 
FAIL: gcc.c-torture/execute/ieee/mul-subnormal-single-1.c execution,  -O2 
FAIL: gcc.c-torture/execute/ieee/mul-subnormal-single-1.c execution,  -O3 -fomit-frame-pointer 
FAIL: gcc.c-torture/execute/ieee/mul-subnormal-single-1.c execution,  -O3 -fomit-frame-pointer -funroll-loops 
FAIL: gcc.c-torture/execute/ieee/mul-subnormal-single-1.c execution,  -O3 -fomit-frame-pointer -funroll-all-loops -finline-functions 
FAIL: gcc.c-torture/execute/ieee/mul-subnormal-single-1.c execution,  -O3 -g 
FAIL: gcc.c-torture/execute/ieee/mul-subnormal-single-1.c execution,  -Os 
FAIL: gcc.dg/20061124-1.c (test for excess errors)
WARNING: gcc.dg/20061124-1.c compilation failed to produce executable
FAIL: gcc.dg/ia64-sync-1.c (test for excess errors)
WARNING: gcc.dg/ia64-sync-1.c compilation failed to produce executable
FAIL: gcc.dg/ia64-sync-2.c (test for excess errors)
WARNING: gcc.dg/ia64-sync-2.c compilation failed to produce executable
FAIL: gcc.dg/ia64-sync-3.c (test for excess errors)
WARNING: gcc.dg/ia64-sync-3.c compilation failed to produce executable
FAIL: gcc.dg/pr37908.c (test for excess errors)
WARNING: gcc.dg/pr37908.c compilation failed to produce executable
FAIL: gcc.dg/sync-2.c (test for excess errors)
WARNING: gcc.dg/sync-2.c compilation failed to produce executable
FAIL: gcc.dg/sync-3.c (test for excess errors)
WARNING: gcc.dg/sync-3.c compilation failed to produce executable
WARNING: program timed out.
FAIL: gcc.target/mips/atomic-memory-1.c  (test for warnings, line )
FAIL: gcc.target/mips/atomic-memory-2.c (test for excess errors)
ERROR: gcc.target/mips/atomic-memory-2.c: error executing dg-final: couldn't open "atomic-memory-2.s": no such file or directory
UNRESOLVED: gcc.target/mips/atomic-memory-2.c: error executing dg-final: couldn't open "atomic-memory-2.s": no such file or directory
FAIL: gcc.target/mips/branch-cost-1.c (test for excess errors)
ERROR: gcc.target/mips/branch-cost-1.c: error executing dg-final: couldn't open "branch-cost-1.s": no such file or directory
UNRESOLVED: gcc.target/mips/branch-cost-1.c: error executing dg-final: couldn't open "branch-cost-1.s": no such file or directory
FAIL: gcc.target/mips/branch-cost-2.c (test for excess errors)
ERROR: gcc.target/mips/branch-cost-2.c: error executing dg-final: couldn't open "branch-cost-2.s": no such file or directory
UNRESOLVED: gcc.target/mips/branch-cost-2.c: error executing dg-final: couldn't open "branch-cost-2.s": no such file or directory
FAIL: gcc.target/mips/cache-1.c (test for excess errors)
ERROR: gcc.target/mips/cache-1.c: error executing dg-final: couldn't open "cache-1.s": no such file or directory
UNRESOLVED: gcc.target/mips/cache-1.c: error executing dg-final: couldn't open "cache-1.s": no such file or directory
FAIL: gcc.target/mips/clear-cache-1.c (test for excess errors)
ERROR: gcc.target/mips/clear-cache-1.c: error executing dg-final: couldn't open "clear-cache-1.s": no such file or directory
UNRESOLVED: gcc.target/mips/clear-cache-1.c: error executing dg-final: couldn't open "clear-cache-1.s": no such file or directory
FAIL: gcc.target/mips/clear-cache-2.c (test for excess errors)
ERROR: gcc.target/mips/clear-cache-2.c: error executing dg-final: couldn't open "clear-cache-2.s": no such file or directory
UNRESOLVED: gcc.target/mips/clear-cache-2.c: error executing dg-final: couldn't open "clear-cache-2.s": no such file or directory
FAIL: gcc.target/mips/dmult-1.c (test for excess errors)
ERROR: gcc.target/mips/dmult-1.c: error executing dg-final: couldn't open "dmult-1.s": no such file or directory
UNRESOLVED: gcc.target/mips/dmult-1.c: error executing dg-final: couldn't open "dmult-1.s": no such file or directory
FAIL: gcc.target/mips/dpaq_sa_l_w.c (test for excess errors)
ERROR: gcc.target/mips/dpaq_sa_l_w.c: error executing dg-final: couldn't open "dpaq_sa_l_w.s": no such file or directory
UNRESOLVED: gcc.target/mips/dpaq_sa_l_w.c: error executing dg-final: couldn't open "dpaq_sa_l_w.s": no such file or directory
FAIL: gcc.target/mips/dpsq_sa_l_w.c (test for excess errors)
ERROR: gcc.target/mips/dpsq_sa_l_w.c: error executing dg-final: couldn't open "dpsq_sa_l_w.s": no such file or directory
UNRESOLVED: gcc.target/mips/dpsq_sa_l_w.c: error executing dg-final: couldn't open "dpsq_sa_l_w.s": no such file or directory
FAIL: gcc.target/mips/dse-1.c (test for excess errors)
ERROR: gcc.target/mips/dse-1.c: error executing dg-final: couldn't open "dse-1.s": no such file or directory
UNRESOLVED: gcc.target/mips/dse-1.c: error executing dg-final: couldn't open "dse-1.s": no such file or directory
WARNING: program timed out.
FAIL: gcc.target/mips/dsp-ctrl.c (test for excess errors)
FAIL: gcc.target/mips/dspr2-MULT.c (test for excess errors)
ERROR: gcc.target/mips/dspr2-MULT.c: error executing dg-final: couldn't open "dspr2-MULT.s": no such file or directory
UNRESOLVED: gcc.target/mips/dspr2-MULT.c: error executing dg-final: couldn't open "dspr2-MULT.s": no such file or directory
FAIL: gcc.target/mips/dspr2-MULTU.c (test for excess errors)
ERROR: gcc.target/mips/dspr2-MULTU.c: error executing dg-final: couldn't open "dspr2-MULTU.s": no such file or directory
UNRESOLVED: gcc.target/mips/dspr2-MULTU.c: error executing dg-final: couldn't open "dspr2-MULTU.s": no such file or directory
FAIL: gcc.target/mips/ext-1.c (test for excess errors)
ERROR: gcc.target/mips/ext-1.c: error executing dg-final: couldn't open "ext-1.s": no such file or directory
UNRESOLVED: gcc.target/mips/ext-1.c: error executing dg-final: couldn't open "ext-1.s": no such file or directory
FAIL: gcc.target/mips/ext_ins.c (test for excess errors)
ERROR: gcc.target/mips/ext_ins.c: error executing dg-final: couldn't open "ext_ins.s": no such file or directory
UNRESOLVED: gcc.target/mips/ext_ins.c: error executing dg-final: couldn't open "ext_ins.s": no such file or directory
FAIL: gcc.target/mips/fix-r10000-1.c (test for excess errors)
ERROR: gcc.target/mips/fix-r10000-1.c: error executing dg-final: couldn't open "fix-r10000-1.s": no such file or directory
UNRESOLVED: gcc.target/mips/fix-r10000-1.c: error executing dg-final: couldn't open "fix-r10000-1.s": no such file or directory
FAIL: gcc.target/mips/fix-r10000-10.c (test for excess errors)
ERROR: gcc.target/mips/fix-r10000-10.c: error executing dg-final: couldn't open "fix-r10000-10.s": no such file or directory
UNRESOLVED: gcc.target/mips/fix-r10000-10.c: error executing dg-final: couldn't open "fix-r10000-10.s": no such file or directory
FAIL: gcc.target/mips/fix-r10000-11.c (test for excess errors)
ERROR: gcc.target/mips/fix-r10000-11.c: error executing dg-final: couldn't open "fix-r10000-11.s": no such file or directory
UNRESOLVED: gcc.target/mips/fix-r10000-11.c: error executing dg-final: couldn't open "fix-r10000-11.s": no such file or directory
FAIL: gcc.target/mips/fix-r10000-12.c  (test for warnings, line )
FAIL: gcc.target/mips/fix-r10000-12.c (test for excess errors)
ERROR: gcc.target/mips/fix-r10000-12.c: error executing dg-final: couldn't open "fix-r10000-12.s": no such file or directory
UNRESOLVED: gcc.target/mips/fix-r10000-12.c: error executing dg-final: couldn't open "fix-r10000-12.s": no such file or directory
FAIL: gcc.target/mips/fix-r10000-13.c (test for excess errors)
ERROR: gcc.target/mips/fix-r10000-13.c: error executing dg-final: couldn't open "fix-r10000-13.s": no such file or directory
UNRESOLVED: gcc.target/mips/fix-r10000-13.c: error executing dg-final: couldn't open "fix-r10000-13.s": no such file or directory
FAIL: gcc.target/mips/fix-r10000-14.c (test for excess errors)
ERROR: gcc.target/mips/fix-r10000-14.c: error executing dg-final: couldn't open "fix-r10000-14.s": no such file or directory
UNRESOLVED: gcc.target/mips/fix-r10000-14.c: error executing dg-final: couldn't open "fix-r10000-14.s": no such file or directory
FAIL: gcc.target/mips/fix-r10000-15.c (test for excess errors)
ERROR: gcc.target/mips/fix-r10000-15.c: error executing dg-final: couldn't open "fix-r10000-15.s": no such file or directory
UNRESOLVED: gcc.target/mips/fix-r10000-15.c: error executing dg-final: couldn't open "fix-r10000-15.s": no such file or directory
FAIL: gcc.target/mips/fix-r10000-2.c (test for excess errors)
ERROR: gcc.target/mips/fix-r10000-2.c: error executing dg-final: couldn't open "fix-r10000-2.s": no such file or directory
UNRESOLVED: gcc.target/mips/fix-r10000-2.c: error executing dg-final: couldn't open "fix-r10000-2.s": no such file or directory
FAIL: gcc.target/mips/fix-r10000-3.c (test for excess errors)
ERROR: gcc.target/mips/fix-r10000-3.c: error executing dg-final: couldn't open "fix-r10000-3.s": no such file or directory
UNRESOLVED: gcc.target/mips/fix-r10000-3.c: error executing dg-final: couldn't open "fix-r10000-3.s": no such file or directory
FAIL: gcc.target/mips/fix-r10000-4.c (test for excess errors)
ERROR: gcc.target/mips/fix-r10000-4.c: error executing dg-final: couldn't open "fix-r10000-4.s": no such file or directory
UNRESOLVED: gcc.target/mips/fix-r10000-4.c: error executing dg-final: couldn't open "fix-r10000-4.s": no such file or directory
FAIL: gcc.target/mips/fix-r10000-5.c (test for excess errors)
ERROR: gcc.target/mips/fix-r10000-5.c: error executing dg-final: couldn't open "fix-r10000-5.s": no such file or directory
UNRESOLVED: gcc.target/mips/fix-r10000-5.c: error executing dg-final: couldn't open "fix-r10000-5.s": no such file or directory
FAIL: gcc.target/mips/fix-r10000-6.c  (test for warnings, line )
FAIL: gcc.target/mips/fix-r10000-6.c (test for excess errors)
ERROR: gcc.target/mips/fix-r10000-6.c: error executing dg-final: couldn't open "fix-r10000-6.s": no such file or directory
UNRESOLVED: gcc.target/mips/fix-r10000-6.c: error executing dg-final: couldn't open "fix-r10000-6.s": no such file or directory
FAIL: gcc.target/mips/fix-r10000-7.c (test for excess errors)
ERROR: gcc.target/mips/fix-r10000-7.c: error executing dg-final: couldn't open "fix-r10000-7.s": no such file or directory
UNRESOLVED: gcc.target/mips/fix-r10000-7.c: error executing dg-final: couldn't open "fix-r10000-7.s": no such file or directory
FAIL: gcc.target/mips/fix-r10000-8.c (test for excess errors)
ERROR: gcc.target/mips/fix-r10000-8.c: error executing dg-final: couldn't open "fix-r10000-8.s": no such file or directory
UNRESOLVED: gcc.target/mips/fix-r10000-8.c: error executing dg-final: couldn't open "fix-r10000-8.s": no such file or directory
FAIL: gcc.target/mips/fix-r10000-9.c (test for excess errors)
ERROR: gcc.target/mips/fix-r10000-9.c: error executing dg-final: couldn't open "fix-r10000-9.s": no such file or directory
UNRESOLVED: gcc.target/mips/fix-r10000-9.c: error executing dg-final: couldn't open "fix-r10000-9.s": no such file or directory
FAIL: gcc.target/mips/fix-r4000-1.c scan-assembler-times \\tmult\\t\\\$[45],\\\$[45][^\\n]+mulsi3_r4000[^\\n]+\\n\\tmflo\\t\\\$2\\n 2
FAIL: gcc.target/mips/fix-r4000-10.c (test for excess errors)
ERROR: gcc.target/mips/fix-r4000-10.c: error executing dg-final: couldn't open "fix-r4000-10.s": no such file or directory
UNRESOLVED: gcc.target/mips/fix-r4000-10.c: error executing dg-final: couldn't open "fix-r4000-10.s": no such file or directory
FAIL: gcc.target/mips/fix-r4000-11.c (test for excess errors)
ERROR: gcc.target/mips/fix-r4000-11.c: error executing dg-final: couldn't open "fix-r4000-11.s": no such file or directory
UNRESOLVED: gcc.target/mips/fix-r4000-11.c: error executing dg-final: couldn't open "fix-r4000-11.s": no such file or directory
FAIL: gcc.target/mips/fix-r4000-12.c (test for excess errors)
ERROR: gcc.target/mips/fix-r4000-12.c: error executing dg-final: couldn't open "fix-r4000-12.s": no such file or directory
UNRESOLVED: gcc.target/mips/fix-r4000-12.c: error executing dg-final: couldn't open "fix-r4000-12.s": no such file or directory
FAIL: gcc.target/mips/fix-r4000-6.c (test for excess errors)
ERROR: gcc.target/mips/fix-r4000-6.c: error executing dg-final: couldn't open "fix-r4000-6.s": no such file or directory
UNRESOLVED: gcc.target/mips/fix-r4000-6.c: error executing dg-final: couldn't open "fix-r4000-6.s": no such file or directory
FAIL: gcc.target/mips/fix-r4000-7.c (test for excess errors)
ERROR: gcc.target/mips/fix-r4000-7.c: error executing dg-final: couldn't open "fix-r4000-7.s": no such file or directory
UNRESOLVED: gcc.target/mips/fix-r4000-7.c: error executing dg-final: couldn't open "fix-r4000-7.s": no such file or directory
FAIL: gcc.target/mips/fix-r4000-8.c (test for excess errors)
ERROR: gcc.target/mips/fix-r4000-8.c: error executing dg-final: couldn't open "fix-r4000-8.s": no such file or directory
UNRESOLVED: gcc.target/mips/fix-r4000-8.c: error executing dg-final: couldn't open "fix-r4000-8.s": no such file or directory
FAIL: gcc.target/mips/fix-r4000-9.c (test for excess errors)
ERROR: gcc.target/mips/fix-r4000-9.c: error executing dg-final: couldn't open "fix-r4000-9.s": no such file or directory
UNRESOLVED: gcc.target/mips/fix-r4000-9.c: error executing dg-final: couldn't open "fix-r4000-9.s": no such file or directory
FAIL: gcc.target/mips/fix-vr4130-1.c scan-assembler \\tmacchi\\t
FAIL: gcc.target/mips/fix-vr4130-2.c scan-assembler \\tmacc\\t
FAIL: gcc.target/mips/fix-vr4130-3.c (test for excess errors)
ERROR: gcc.target/mips/fix-vr4130-3.c: error executing dg-final: couldn't open "fix-vr4130-3.s": no such file or directory
UNRESOLVED: gcc.target/mips/fix-vr4130-3.c: error executing dg-final: couldn't open "fix-vr4130-3.s": no such file or directory
FAIL: gcc.target/mips/fix-vr4130-4.c (test for excess errors)
ERROR: gcc.target/mips/fix-vr4130-4.c: error executing dg-final: couldn't open "fix-vr4130-4.s": no such file or directory
UNRESOLVED: gcc.target/mips/fix-vr4130-4.c: error executing dg-final: couldn't open "fix-vr4130-4.s": no such file or directory
FAIL: gcc.target/mips/fixed-scalar-type.c (test for excess errors)
ERROR: gcc.target/mips/fixed-scalar-type.c: error executing dg-final: couldn't open "fixed-scalar-type.s": no such file or directory
UNRESOLVED: gcc.target/mips/fixed-scalar-type.c: error executing dg-final: couldn't open "fixed-scalar-type.s": no such file or directory
FAIL: gcc.target/mips/fixed-vector-type.c (test for excess errors)
ERROR: gcc.target/mips/fixed-vector-type.c: error executing dg-final: couldn't open "fixed-vector-type.s": no such file or directory
UNRESOLVED: gcc.target/mips/fixed-vector-type.c: error executing dg-final: couldn't open "fixed-vector-type.s": no such file or directory
FAIL: gcc.target/mips/fpr-moves-3.c (test for excess errors)
ERROR: gcc.target/mips/fpr-moves-3.c: error executing dg-final: couldn't open "fpr-moves-3.s": no such file or directory
UNRESOLVED: gcc.target/mips/fpr-moves-3.c: error executing dg-final: couldn't open "fpr-moves-3.s": no such file or directory
FAIL: gcc.target/mips/fpr-moves-4.c (test for excess errors)
ERROR: gcc.target/mips/fpr-moves-4.c: error executing dg-final: couldn't open "fpr-moves-4.s": no such file or directory
UNRESOLVED: gcc.target/mips/fpr-moves-4.c: error executing dg-final: couldn't open "fpr-moves-4.s": no such file or directory
FAIL: gcc.target/mips/fpr-moves-5.c (test for excess errors)
ERROR: gcc.target/mips/fpr-moves-5.c: error executing dg-final: couldn't open "fpr-moves-5.s": no such file or directory
UNRESOLVED: gcc.target/mips/fpr-moves-5.c: error executing dg-final: couldn't open "fpr-moves-5.s": no such file or directory
FAIL: gcc.target/mips/fpr-moves-6.c (test for excess errors)
ERROR: gcc.target/mips/fpr-moves-6.c: error executing dg-final: couldn't open "fpr-moves-6.s": no such file or directory
UNRESOLVED: gcc.target/mips/fpr-moves-6.c: error executing dg-final: couldn't open "fpr-moves-6.s": no such file or directory
FAIL: gcc.target/mips/fpr-moves-7.c (test for excess errors)
FAIL: gcc.target/mips/fpr-moves-8.c (test for excess errors)
FAIL: gcc.target/mips/gcc-have-sync-compare-and-swap-1.c (test for excess errors)
FAIL: gcc.target/mips/gcc-have-sync-compare-and-swap-2.c (test for excess errors)
FAIL: gcc.target/mips/gcc-have-sync-compare-and-swap-3.c (test for excess errors)
FAIL: gcc.target/mips/gcc-have-sync-compare-and-swap-4.c (test for excess errors)
FAIL: gcc.target/mips/ins-1.c (test for excess errors)
ERROR: gcc.target/mips/ins-1.c: error executing dg-final: couldn't open "ins-1.s": no such file or directory
UNRESOLVED: gcc.target/mips/ins-1.c: error executing dg-final: couldn't open "ins-1.s": no such file or directory
FAIL: gcc.target/mips/ins-2.c (test for excess errors)
ERROR: gcc.target/mips/ins-2.c: error executing dg-final: couldn't open "ins-2.s": no such file or directory
UNRESOLVED: gcc.target/mips/ins-2.c: error executing dg-final: couldn't open "ins-2.s": no such file or directory
FAIL: gcc.target/mips/int-moves-1.c (test for excess errors)
FAIL: gcc.target/mips/int-moves-2.c (test for excess errors)
FAIL: gcc.target/mips/loongson-muldiv-1.c scan-assembler-times 	multu.g	 2
FAIL: gcc.target/mips/loongson-muldiv-1.c scan-assembler-times 	divu.g	 1
FAIL: gcc.target/mips/loongson-muldiv-1.c scan-assembler-times 	modu.g	 1
FAIL: gcc.target/mips/loongson-muldiv-1.c scan-assembler-times 	div.g	 1
FAIL: gcc.target/mips/loongson-muldiv-1.c scan-assembler-times 	mod.g	 1
FAIL: gcc.target/mips/loongson-muldiv-2.c (test for excess errors)
ERROR: gcc.target/mips/loongson-muldiv-2.c: error executing dg-final: couldn't open "loongson-muldiv-2.s": no such file or directory
UNRESOLVED: gcc.target/mips/loongson-muldiv-2.c: error executing dg-final: couldn't open "loongson-muldiv-2.s": no such file or directory
FAIL: gcc.target/mips/loongson-simd.c (test for excess errors)
FAIL: gcc.target/mips/madd-1.c scan-assembler-times 	macc	\\\$1, 3
FAIL: gcc.target/mips/madd-2.c scan-assembler-times 	madd	 3
FAIL: gcc.target/mips/madd-3.c (test for excess errors)
ERROR: gcc.target/mips/madd-3.c: error executing dg-final: couldn't open "madd-3.s": no such file or directory
UNRESOLVED: gcc.target/mips/madd-3.c: error executing dg-final: couldn't open "madd-3.s": no such file or directory
FAIL: gcc.target/mips/madd-4.c (test for excess errors)
ERROR: gcc.target/mips/madd-4.c: error executing dg-final: couldn't open "madd-4.s": no such file or directory
UNRESOLVED: gcc.target/mips/madd-4.c: error executing dg-final: couldn't open "madd-4.s": no such file or directory
FAIL: gcc.target/mips/madd-5.c scan-assembler-times 	mflo	 3
FAIL: gcc.target/mips/madd-6.c scan-assembler \\tmul\\t
FAIL: gcc.target/mips/madd-8.c scan-assembler \\tmul\\t
FAIL: gcc.target/mips/maddu-1.c scan-assembler-times 	maccu	\\\$1, 3
FAIL: gcc.target/mips/maddu-2.c scan-assembler-times 	maddu	 3
FAIL: gcc.target/mips/maddu-3.c (test for excess errors)
ERROR: gcc.target/mips/maddu-3.c: error executing dg-final: couldn't open "maddu-3.s": no such file or directory
UNRESOLVED: gcc.target/mips/maddu-3.c: error executing dg-final: couldn't open "maddu-3.s": no such file or directory
FAIL: gcc.target/mips/maddu-4.c (test for excess errors)
ERROR: gcc.target/mips/maddu-4.c: error executing dg-final: couldn't open "maddu-4.s": no such file or directory
UNRESOLVED: gcc.target/mips/maddu-4.c: error executing dg-final: couldn't open "maddu-4.s": no such file or directory
WARNING: program timed out.
FAIL: gcc.target/mips/mips-3d-1.c (test for excess errors)
FAIL: gcc.target/mips/mips-3d-2.c (test for excess errors)
FAIL: gcc.target/mips/mips-3d-3.c (test for excess errors)
FAIL: gcc.target/mips/mips-3d-4.c (test for excess errors)
FAIL: gcc.target/mips/mips-3d-5.c (test for excess errors)
FAIL: gcc.target/mips/mips-3d-6.c (test for excess errors)
FAIL: gcc.target/mips/mips-3d-7.c (test for excess errors)
FAIL: gcc.target/mips/mips-3d-8.c (test for excess errors)
FAIL: gcc.target/mips/mips-3d-9.c (test for excess errors)
WARNING: program timed out.
FAIL: gcc.target/mips/mips-ps-1.c (test for excess errors)
FAIL: gcc.target/mips/mips-ps-2.c (test for excess errors)
FAIL: gcc.target/mips/mips-ps-3.c (test for excess errors)
FAIL: gcc.target/mips/mips-ps-4.c (test for excess errors)
FAIL: gcc.target/mips/mips-ps-5.c (test for excess errors)
ERROR: gcc.target/mips/mips-ps-5.c: error executing dg-final: couldn't open "mips-ps-5.s": no such file or directory
UNRESOLVED: gcc.target/mips/mips-ps-5.c: error executing dg-final: couldn't open "mips-ps-5.s": no such file or directory
FAIL: gcc.target/mips/mips-ps-6.c (test for excess errors)
FAIL: gcc.target/mips/mips-ps-7.c (test for excess errors)
ERROR: gcc.target/mips/mips-ps-7.c: error executing dg-final: couldn't open "mips-ps-7.s": no such file or directory
UNRESOLVED: gcc.target/mips/mips-ps-7.c: error executing dg-final: couldn't open "mips-ps-7.s": no such file or directory
FAIL: gcc.target/mips/mips-ps-type-2.c (test for excess errors)
ERROR: gcc.target/mips/mips-ps-type-2.c: error executing dg-final: couldn't open "mips-ps-type-2.s": no such file or directory
UNRESOLVED: gcc.target/mips/mips-ps-type-2.c: error executing dg-final: couldn't open "mips-ps-type-2.s": no such file or directory
FAIL: gcc.target/mips/mips-ps-type.c (test for excess errors)
ERROR: gcc.target/mips/mips-ps-type.c: error executing dg-final: couldn't open "mips-ps-type.s": no such file or directory
UNRESOLVED: gcc.target/mips/mips-ps-type.c: error executing dg-final: couldn't open "mips-ps-type.s": no such file or directory
FAIL: gcc.target/mips/mips16e-extends.c (test for excess errors)
ERROR: gcc.target/mips/mips16e-extends.c: error executing dg-final: couldn't open "mips16e-extends.s": no such file or directory
UNRESOLVED: gcc.target/mips/mips16e-extends.c: error executing dg-final: couldn't open "mips16e-extends.s": no such file or directory
FAIL: gcc.target/mips/mips32-dsp-run.c (test for excess errors)
FAIL: gcc.target/mips/mips32-dsp-type.c (test for excess errors)
ERROR: gcc.target/mips/mips32-dsp-type.c: error executing dg-final: couldn't open "mips32-dsp-type.s": no such file or directory
UNRESOLVED: gcc.target/mips/mips32-dsp-type.c: error executing dg-final: couldn't open "mips32-dsp-type.s": no such file or directory
FAIL: gcc.target/mips/mips32-dsp.c (test for excess errors)
ERROR: gcc.target/mips/mips32-dsp.c: error executing dg-final: couldn't open "mips32-dsp.s": no such file or directory
UNRESOLVED: gcc.target/mips/mips32-dsp.c: error executing dg-final: couldn't open "mips32-dsp.s": no such file or directory
FAIL: gcc.target/mips/mips32-dspr2-type.c (test for excess errors)
ERROR: gcc.target/mips/mips32-dspr2-type.c: error executing dg-final: couldn't open "mips32-dspr2-type.s": no such file or directory
UNRESOLVED: gcc.target/mips/mips32-dspr2-type.c: error executing dg-final: couldn't open "mips32-dspr2-type.s": no such file or directory
WARNING: program timed out.
FAIL: gcc.target/mips/mips32-dspr2.c (test for excess errors)
FAIL: gcc.target/mips/mips32r2-mxhc1.c (test for excess errors)
ERROR: gcc.target/mips/mips32r2-mxhc1.c: error executing dg-final: couldn't open "mips32r2-mxhc1.s": no such file or directory
UNRESOLVED: gcc.target/mips/mips32r2-mxhc1.c: error executing dg-final: couldn't open "mips32r2-mxhc1.s": no such file or directory
FAIL: gcc.target/mips/movcc-1.c (test for excess errors)
ERROR: gcc.target/mips/movcc-1.c: error executing dg-final: couldn't open "movcc-1.s": no such file or directory
UNRESOLVED: gcc.target/mips/movcc-1.c: error executing dg-final: couldn't open "movcc-1.s": no such file or directory
FAIL: gcc.target/mips/movcc-2.c (test for excess errors)
ERROR: gcc.target/mips/movcc-2.c: error executing dg-final: couldn't open "movcc-2.s": no such file or directory
UNRESOLVED: gcc.target/mips/movcc-2.c: error executing dg-final: couldn't open "movcc-2.s": no such file or directory
FAIL: gcc.target/mips/movcc-3.c (test for excess errors)
ERROR: gcc.target/mips/movcc-3.c: error executing dg-final: couldn't open "movcc-3.s": no such file or directory
UNRESOLVED: gcc.target/mips/movcc-3.c: error executing dg-final: couldn't open "movcc-3.s": no such file or directory
FAIL: gcc.target/mips/msub-1.c scan-assembler-times 	msac	\\\$0, 2
FAIL: gcc.target/mips/msub-2.c scan-assembler-times 	msub	 2
FAIL: gcc.target/mips/msub-3.c (test for excess errors)
ERROR: gcc.target/mips/msub-3.c: error executing dg-final: couldn't open "msub-3.s": no such file or directory
UNRESOLVED: gcc.target/mips/msub-3.c: error executing dg-final: couldn't open "msub-3.s": no such file or directory
FAIL: gcc.target/mips/msub-4.c (test for excess errors)
ERROR: gcc.target/mips/msub-4.c: error executing dg-final: couldn't open "msub-4.s": no such file or directory
UNRESOLVED: gcc.target/mips/msub-4.c: error executing dg-final: couldn't open "msub-4.s": no such file or directory
FAIL: gcc.target/mips/msub-5.c scan-assembler-times 	msub	 4
FAIL: gcc.target/mips/msub-5.c scan-assembler-times 	mflo	 3
FAIL: gcc.target/mips/msub-6.c scan-assembler \\tmul\\t
FAIL: gcc.target/mips/msub-7.c scan-assembler \\tmsub\\t
FAIL: gcc.target/mips/msub-8.c scan-assembler \\tmul\\t
FAIL: gcc.target/mips/msubu-1.c scan-assembler-times 	msacu	\\\$0, 2
FAIL: gcc.target/mips/msubu-2.c scan-assembler-times 	msubu	 2
FAIL: gcc.target/mips/msubu-3.c (test for excess errors)
ERROR: gcc.target/mips/msubu-3.c: error executing dg-final: couldn't open "msubu-3.s": no such file or directory
UNRESOLVED: gcc.target/mips/msubu-3.c: error executing dg-final: couldn't open "msubu-3.s": no such file or directory
FAIL: gcc.target/mips/msubu-4.c (test for excess errors)
ERROR: gcc.target/mips/msubu-4.c: error executing dg-final: couldn't open "msubu-4.s": no such file or directory
UNRESOLVED: gcc.target/mips/msubu-4.c: error executing dg-final: couldn't open "msubu-4.s": no such file or directory
FAIL: gcc.target/mips/nmadd-1.c (test for excess errors)
ERROR: gcc.target/mips/nmadd-1.c: error executing dg-final: couldn't open "nmadd-1.s": no such file or directory
UNRESOLVED: gcc.target/mips/nmadd-1.c: error executing dg-final: couldn't open "nmadd-1.s": no such file or directory
FAIL: gcc.target/mips/nmadd-2.c (test for excess errors)
ERROR: gcc.target/mips/nmadd-2.c: error executing dg-final: couldn't open "nmadd-2.s": no such file or directory
UNRESOLVED: gcc.target/mips/nmadd-2.c: error executing dg-final: couldn't open "nmadd-2.s": no such file or directory
FAIL: gcc.target/mips/nmadd-3.c (test for excess errors)
ERROR: gcc.target/mips/nmadd-3.c: error executing dg-final: couldn't open "nmadd-3.s": no such file or directory
UNRESOLVED: gcc.target/mips/nmadd-3.c: error executing dg-final: couldn't open "nmadd-3.s": no such file or directory
FAIL: gcc.target/mips/octeon-baddu-1.c scan-assembler-times 	baddu	 4
FAIL: gcc.target/mips/octeon-baddu-1.c scan-assembler-not \\tandi\\t
FAIL: gcc.target/mips/octeon-bbit-1.c scan-assembler-times 	bbit1	 4
FAIL: gcc.target/mips/octeon-bbit-1.c scan-assembler-times 	bbit0	 2
FAIL: gcc.target/mips/octeon-bbit-1.c scan-assembler-not andi\\t
FAIL: gcc.target/mips/octeon-bbit-2.c (test for excess errors)
FAIL: gcc.target/mips/octeon-bbit-2.c scan-assembler \\tbbit[01]\\t
FAIL: gcc.target/mips/octeon-bbit-3.c scan-assembler-times 	bbit[01]	|	bgez	 2
FAIL: gcc.target/mips/octeon-cins-1.c scan-assembler-times 	cins	 3
FAIL: gcc.target/mips/octeon-cins-1.c scan-assembler-not \\tandi\\t|sll\\t
FAIL: gcc.target/mips/octeon-cins-2.c (test for excess errors)
ERROR: gcc.target/mips/octeon-cins-2.c: error executing dg-final: couldn't open "octeon-cins-2.s": no such file or directory
UNRESOLVED: gcc.target/mips/octeon-cins-2.c: error executing dg-final: couldn't open "octeon-cins-2.s": no such file or directory
FAIL: gcc.target/mips/octeon-dmul-1.c (test for excess errors)
ERROR: gcc.target/mips/octeon-dmul-1.c: error executing dg-final: couldn't open "octeon-dmul-1.s": no such file or directory
UNRESOLVED: gcc.target/mips/octeon-dmul-1.c: error executing dg-final: couldn't open "octeon-dmul-1.s": no such file or directory
FAIL: gcc.target/mips/octeon-dmul-2.c (test for excess errors)
ERROR: gcc.target/mips/octeon-dmul-2.c: error executing dg-final: couldn't open "octeon-dmul-2.s": no such file or directory
UNRESOLVED: gcc.target/mips/octeon-dmul-2.c: error executing dg-final: couldn't open "octeon-dmul-2.s": no such file or directory
FAIL: gcc.target/mips/octeon-exts-1.c scan-assembler \\texts\\t
FAIL: gcc.target/mips/octeon-exts-2.c scan-assembler-times 	exts	 4
FAIL: gcc.target/mips/octeon-exts-3.c (test for excess errors)
ERROR: gcc.target/mips/octeon-exts-3.c: error executing dg-final: couldn't open "octeon-exts-3.s": no such file or directory
UNRESOLVED: gcc.target/mips/octeon-exts-3.c: error executing dg-final: couldn't open "octeon-exts-3.s": no such file or directory
FAIL: gcc.target/mips/octeon-exts-4.c (test for excess errors)
ERROR: gcc.target/mips/octeon-exts-4.c: error executing dg-final: couldn't open "octeon-exts-4.s": no such file or directory
UNRESOLVED: gcc.target/mips/octeon-exts-4.c: error executing dg-final: couldn't open "octeon-exts-4.s": no such file or directory
FAIL: gcc.target/mips/octeon-exts-5.c scan-assembler-times 	exts	 4
FAIL: gcc.target/mips/octeon-pop-1.c (test for excess errors)
ERROR: gcc.target/mips/octeon-pop-1.c: error executing dg-final: couldn't open "octeon-pop-1.s": no such file or directory
UNRESOLVED: gcc.target/mips/octeon-pop-1.c: error executing dg-final: couldn't open "octeon-pop-1.s": no such file or directory
FAIL: gcc.target/mips/octeon-seq-1.c scan-assembler-times 	seq	|	seqi	 4
FAIL: gcc.target/mips/octeon-seq-1.c scan-assembler-times 	sne	|	snei	 4
FAIL: gcc.target/mips/octeon-seq-2.c (test for excess errors)
ERROR: gcc.target/mips/octeon-seq-2.c: error executing dg-final: couldn't open "octeon-seq-2.s": no such file or directory
UNRESOLVED: gcc.target/mips/octeon-seq-2.c: error executing dg-final: couldn't open "octeon-seq-2.s": no such file or directory
FAIL: gcc.target/mips/octeon-seq-3.c (test for excess errors)
ERROR: gcc.target/mips/octeon-seq-3.c: error executing dg-final: couldn't open "octeon-seq-3.s": no such file or directory
UNRESOLVED: gcc.target/mips/octeon-seq-3.c: error executing dg-final: couldn't open "octeon-seq-3.s": no such file or directory
FAIL: gcc.target/mips/octeon-seq-4.c scan-assembler-not xor
FAIL: gcc.target/mips/pr33256.c (test for excess errors)
FAIL: gcc.target/mips/pr33635-1.c (test for excess errors)
FAIL: gcc.target/mips/pr34831.c (test for excess errors)
FAIL: gcc.target/mips/pr37362.c (test for excess errors)
FAIL: gcc.target/mips/r10k-cache-barrier-1.c (test for excess errors)
ERROR: gcc.target/mips/r10k-cache-barrier-1.c: error executing dg-final: couldn't open "r10k-cache-barrier-1.s": no such file or directory
UNRESOLVED: gcc.target/mips/r10k-cache-barrier-1.c: error executing dg-final: couldn't open "r10k-cache-barrier-1.s": no such file or directory
FAIL: gcc.target/mips/r10k-cache-barrier-10.c (test for excess errors)
ERROR: gcc.target/mips/r10k-cache-barrier-10.c: error executing dg-final: couldn't open "r10k-cache-barrier-10.s": no such file or directory
UNRESOLVED: gcc.target/mips/r10k-cache-barrier-10.c: error executing dg-final: couldn't open "r10k-cache-barrier-10.s": no such file or directory
FAIL: gcc.target/mips/r10k-cache-barrier-11.c (test for excess errors)
ERROR: gcc.target/mips/r10k-cache-barrier-11.c: error executing dg-final: couldn't open "r10k-cache-barrier-11.s": no such file or directory
UNRESOLVED: gcc.target/mips/r10k-cache-barrier-11.c: error executing dg-final: couldn't open "r10k-cache-barrier-11.s": no such file or directory
FAIL: gcc.target/mips/r10k-cache-barrier-12.c (test for excess errors)
ERROR: gcc.target/mips/r10k-cache-barrier-12.c: error executing dg-final: couldn't open "r10k-cache-barrier-12.s": no such file or directory
UNRESOLVED: gcc.target/mips/r10k-cache-barrier-12.c: error executing dg-final: couldn't open "r10k-cache-barrier-12.s": no such file or directory
FAIL: gcc.target/mips/r10k-cache-barrier-13.c (test for excess errors)
ERROR: gcc.target/mips/r10k-cache-barrier-13.c: error executing dg-final: couldn't open "r10k-cache-barrier-13.s": no such file or directory
UNRESOLVED: gcc.target/mips/r10k-cache-barrier-13.c: error executing dg-final: couldn't open "r10k-cache-barrier-13.s": no such file or directory
FAIL: gcc.target/mips/r10k-cache-barrier-14.c  (test for warnings, line 5)
FAIL: gcc.target/mips/r10k-cache-barrier-14.c (test for excess errors)
FAIL: gcc.target/mips/r10k-cache-barrier-15.c (test for excess errors)
FAIL: gcc.target/mips/r10k-cache-barrier-2.c (test for excess errors)
ERROR: gcc.target/mips/r10k-cache-barrier-2.c: error executing dg-final: couldn't open "r10k-cache-barrier-2.s": no such file or directory
UNRESOLVED: gcc.target/mips/r10k-cache-barrier-2.c: error executing dg-final: couldn't open "r10k-cache-barrier-2.s": no such file or directory
FAIL: gcc.target/mips/r10k-cache-barrier-3.c (test for excess errors)
ERROR: gcc.target/mips/r10k-cache-barrier-3.c: error executing dg-final: couldn't open "r10k-cache-barrier-3.s": no such file or directory
UNRESOLVED: gcc.target/mips/r10k-cache-barrier-3.c: error executing dg-final: couldn't open "r10k-cache-barrier-3.s": no such file or directory
FAIL: gcc.target/mips/r10k-cache-barrier-4.c (test for excess errors)
ERROR: gcc.target/mips/r10k-cache-barrier-4.c: error executing dg-final: couldn't open "r10k-cache-barrier-4.s": no such file or directory
UNRESOLVED: gcc.target/mips/r10k-cache-barrier-4.c: error executing dg-final: couldn't open "r10k-cache-barrier-4.s": no such file or directory
FAIL: gcc.target/mips/r10k-cache-barrier-5.c (test for excess errors)
ERROR: gcc.target/mips/r10k-cache-barrier-5.c: error executing dg-final: couldn't open "r10k-cache-barrier-5.s": no such file or directory
UNRESOLVED: gcc.target/mips/r10k-cache-barrier-5.c: error executing dg-final: couldn't open "r10k-cache-barrier-5.s": no such file or directory
FAIL: gcc.target/mips/r10k-cache-barrier-6.c (test for excess errors)
ERROR: gcc.target/mips/r10k-cache-barrier-6.c: error executing dg-final: couldn't open "r10k-cache-barrier-6.s": no such file or directory
UNRESOLVED: gcc.target/mips/r10k-cache-barrier-6.c: error executing dg-final: couldn't open "r10k-cache-barrier-6.s": no such file or directory
FAIL: gcc.target/mips/r10k-cache-barrier-7.c (test for excess errors)
ERROR: gcc.target/mips/r10k-cache-barrier-7.c: error executing dg-final: couldn't open "r10k-cache-barrier-7.s": no such file or directory
UNRESOLVED: gcc.target/mips/r10k-cache-barrier-7.c: error executing dg-final: couldn't open "r10k-cache-barrier-7.s": no such file or directory
FAIL: gcc.target/mips/r10k-cache-barrier-8.c (test for excess errors)
ERROR: gcc.target/mips/r10k-cache-barrier-8.c: error executing dg-final: couldn't open "r10k-cache-barrier-8.s": no such file or directory
UNRESOLVED: gcc.target/mips/r10k-cache-barrier-8.c: error executing dg-final: couldn't open "r10k-cache-barrier-8.s": no such file or directory
FAIL: gcc.target/mips/r10k-cache-barrier-9.c (test for excess errors)
ERROR: gcc.target/mips/r10k-cache-barrier-9.c: error executing dg-final: couldn't open "r10k-cache-barrier-9.s": no such file or directory
UNRESOLVED: gcc.target/mips/r10k-cache-barrier-9.c: error executing dg-final: couldn't open "r10k-cache-barrier-9.s": no such file or directory
FAIL: gcc.target/mips/rsqrt-1.c (test for excess errors)
ERROR: gcc.target/mips/rsqrt-1.c: error executing dg-final: couldn't open "rsqrt-1.s": no such file or directory
UNRESOLVED: gcc.target/mips/rsqrt-1.c: error executing dg-final: couldn't open "rsqrt-1.s": no such file or directory
FAIL: gcc.target/mips/rsqrt-2.c (test for excess errors)
ERROR: gcc.target/mips/rsqrt-2.c: error executing dg-final: couldn't open "rsqrt-2.s": no such file or directory
UNRESOLVED: gcc.target/mips/rsqrt-2.c: error executing dg-final: couldn't open "rsqrt-2.s": no such file or directory
FAIL: gcc.target/mips/rsqrt-3.c (test for excess errors)
ERROR: gcc.target/mips/rsqrt-3.c: error executing dg-final: couldn't open "rsqrt-3.s": no such file or directory
UNRESOLVED: gcc.target/mips/rsqrt-3.c: error executing dg-final: couldn't open "rsqrt-3.s": no such file or directory
FAIL: gcc.target/mips/rsqrt-4.c (test for excess errors)
ERROR: gcc.target/mips/rsqrt-4.c: error executing dg-final: couldn't open "rsqrt-4.s": no such file or directory
UNRESOLVED: gcc.target/mips/rsqrt-4.c: error executing dg-final: couldn't open "rsqrt-4.s": no such file or directory
FAIL: gcc.target/mips/save-restore-1.c (test for excess errors)
ERROR: gcc.target/mips/save-restore-1.c: error executing dg-final: couldn't open "save-restore-1.s": no such file or directory
UNRESOLVED: gcc.target/mips/save-restore-1.c: error executing dg-final: couldn't open "save-restore-1.s": no such file or directory
FAIL: gcc.target/mips/save-restore-2.c (test for excess errors)
ERROR: gcc.target/mips/save-restore-2.c: error executing dg-final: couldn't open "save-restore-2.s": no such file or directory
UNRESOLVED: gcc.target/mips/save-restore-2.c: error executing dg-final: couldn't open "save-restore-2.s": no such file or directory
FAIL: gcc.target/mips/save-restore-3.c (test for excess errors)
ERROR: gcc.target/mips/save-restore-3.c: error executing dg-final: couldn't open "save-restore-3.s": no such file or directory
UNRESOLVED: gcc.target/mips/save-restore-3.c: error executing dg-final: couldn't open "save-restore-3.s": no such file or directory
FAIL: gcc.target/mips/save-restore-4.c (test for excess errors)
ERROR: gcc.target/mips/save-restore-4.c: error executing dg-final: couldn't open "save-restore-4.s": no such file or directory
UNRESOLVED: gcc.target/mips/save-restore-4.c: error executing dg-final: couldn't open "save-restore-4.s": no such file or directory
FAIL: gcc.target/mips/save-restore-5.c (test for excess errors)
FAIL: gcc.target/mips/sb1-1.c (test for excess errors)
ERROR: gcc.target/mips/sb1-1.c: error executing dg-final: couldn't open "sb1-1.s": no such file or directory
UNRESOLVED: gcc.target/mips/sb1-1.c: error executing dg-final: couldn't open "sb1-1.s": no such file or directory
FAIL: gcc.target/mips/scc-1.c (test for excess errors)
ERROR: gcc.target/mips/scc-1.c: error executing dg-final: couldn't open "scc-1.s": no such file or directory
UNRESOLVED: gcc.target/mips/scc-1.c: error executing dg-final: couldn't open "scc-1.s": no such file or directory
FAIL: gcc.target/mips/scc-2.c (test for excess errors)
ERROR: gcc.target/mips/scc-2.c: error executing dg-final: couldn't open "scc-2.s": no such file or directory
UNRESOLVED: gcc.target/mips/scc-2.c: error executing dg-final: couldn't open "scc-2.s": no such file or directory
FAIL: gcc.target/mips/scc-3.c (test for excess errors)
ERROR: gcc.target/mips/scc-3.c: error executing dg-final: couldn't open "scc-3.s": no such file or directory
UNRESOLVED: gcc.target/mips/scc-3.c: error executing dg-final: couldn't open "scc-3.s": no such file or directory
FAIL: gcc.target/mips/scc-4.c (test for excess errors)
ERROR: gcc.target/mips/scc-4.c: error executing dg-final: couldn't open "scc-4.s": no such file or directory
UNRESOLVED: gcc.target/mips/scc-4.c: error executing dg-final: couldn't open "scc-4.s": no such file or directory
FAIL: gcc.target/mips/sdata-1.c scan-assembler %gp_?rel\\\\(l4a\\\\)
FAIL: gcc.target/mips/sdata-1.c scan-assembler %gp_?rel\\\\(l4b\\\\)
FAIL: gcc.target/mips/sdata-1.c scan-assembler %gp_?rel\\\\(e4a\\\\)
FAIL: gcc.target/mips/sdata-1.c scan-assembler %gp_?rel\\\\(c4\\\\)
FAIL: gcc.target/mips/sdata-1.c scan-assembler %gp_?rel\\\\(g4a\\\\)
FAIL: gcc.target/mips/sdata-1.c scan-assembler %gp_?rel\\\\(g4b\\\\)
FAIL: gcc.target/mips/sdata-2.c scan-assembler %gp_?rel\\\\(e4a\\\\)
FAIL: gcc.target/mips/sdata-2.c scan-assembler %gp_?rel\\\\(c4\\\\)
FAIL: gcc.target/mips/sdata-2.c scan-assembler %gp_?rel\\\\(g4a\\\\)
FAIL: gcc.target/mips/sdata-2.c scan-assembler %gp_?rel\\\\(g4b\\\\)
FAIL: gcc.target/mips/sdata-3.c scan-assembler %gp_?rel\\\\(l4a\\\\)
FAIL: gcc.target/mips/sdata-3.c scan-assembler %gp_?rel\\\\(l4b\\\\)
FAIL: gcc.target/mips/sdata-3.c scan-assembler %gp_?rel\\\\(g4a\\\\)
FAIL: gcc.target/mips/sdata-3.c scan-assembler %gp_?rel\\\\(g4b\\\\)
FAIL: gcc.target/mips/timode-1.c (test for excess errors)
ERROR: gcc.target/mips/timode-1.c: error executing dg-final: couldn't open "timode-1.s": no such file or directory
UNRESOLVED: gcc.target/mips/timode-1.c: error executing dg-final: couldn't open "timode-1.s": no such file or directory
FAIL: gcc.target/mips/timode-2.c (test for excess errors)
FAIL: gcc.target/mips/truncate-1.c (test for excess errors)
ERROR: gcc.target/mips/truncate-1.c: error executing dg-final: couldn't open "truncate-1.s": no such file or directory
UNRESOLVED: gcc.target/mips/truncate-1.c: error executing dg-final: couldn't open "truncate-1.s": no such file or directory
FAIL: gcc.target/mips/truncate-2.c (test for excess errors)
ERROR: gcc.target/mips/truncate-2.c: error executing dg-final: couldn't open "truncate-2.s": no such file or directory
UNRESOLVED: gcc.target/mips/truncate-2.c: error executing dg-final: couldn't open "truncate-2.s": no such file or directory
FAIL: gcc.target/mips/vr-mult-1.c scan-assembler \\tmul\\t.*\\tmul\\t
FAIL: gcc.target/mips/vr-mult-2.c scan-assembler \\tmul\\t.*\\tmul\\t

		=== gcc Summary ===

# of expected passes		49425
# of unexpected failures	218
# of expected failures		121
# of unresolved testcases	107
# of unsupported tests		529
/home/joel/test-gcc/b-gcc1-mips/gcc/xgcc  version 4.4.0 20090130 (experimental) [trunk revision 143810] (GCC) 

Host   is x86_64-unknown-linux-gnu

		=== g++ tests ===


Running target rtems-mips-jmr3904
FAIL: g++.dg/eh/gcsec1.C execution test
FAIL: g++.dg/eh/simd-2.C (test for excess errors)
WARNING: g++.dg/eh/simd-2.C compilation failed to produce executable
FAIL: g++.dg/init/array15.C execution test
FAIL: g++.dg/init/array16.C execution test
FAIL: g++.dg/init/ref15.C execution test
FAIL: g++.dg/ipa/iinline-1.C scan-ipa-dump inline "String::funcOne[^\\n]*inline copy in int main"
WARNING: program timed out.
XPASS: g++.old-deja/g++.other/init19.C execution test

		=== g++ Summary ===

# of expected passes		18266
# of unexpected failures	6
# of unexpected successes	1
# of expected failures		141
# of unsupported tests		185
/home/joel/test-gcc/b-gcc1-mips/gcc/testsuite/g++/../../g++  version 4.4.0 20090130 (experimental) [trunk revision 143810] (GCC) 


Compiler version: 4.4.0 20090130 (experimental) [trunk revision 143810] (GCC) 
Platform: mips-unknown-rtems4.10
configure flags: --enable-threads=rtems --with-gnu-as --enable-multilib --enable-newlib-mb --enable-newlib-iconv --with-gnu-ld --with-newlib --verbose --with-system-zlib --disable-nls --enable-version-specific-runtime-libs --enable-languages=c,c++ --target=mips-rtems4.10 --prefix=/home/joel/test-gcc/install


More information about the Rtems-tooltestresults mailing list