[Date Prev][Date Next][Thread Prev][Thread Next][Date Index][Thread Index]

Re: 4.6.99.2 csb337 BSPbuilding Error



Remove the offending lines. Not a nice solution, but it works. I did so,
and the board works fine.


Ray wrote:

>Hi:
>	I just donwload this version, and find csb337 would not make, error message looks like:
>
>......
>../../../../../../../../rtems-4.6.99.2/c/src/lib/libbsp/arm/csb337/../../shared/console.c: In function 'console_close':
>../../../../../../../../rtems-4.6.99.2/c/src/lib/libbsp/arm/csb337/../../shared/console.c:134: error: 'current_tty' undeclared (first use in this function)
>../../../../../../../../rtems-4.6.99.2/c/src/lib/libbsp/arm/csb337/../../shared/console.c:134: error: (Each undeclared identifier is reported only once
>../../../../../../../../rtems-4.6.99.2/c/src/lib/libbsp/arm/csb337/../../shared/console.c:134: error: for each function it appears in.)
>gmake[6]: *** [console_rel-console.o] Error 1
>gmake[6]: Leaving directory `/root/rtems/9200/arm-rtems4.7/c/csb337/lib/libbsp/arm/csb337'
>gmake[5]: *** [all-recursive] Error 1
>......
>
>	Any tips? 
>	
>		 
>        Raymond
>        xr@trasin.net
>          2005-11-29
>
>  
>