[Date Prev][Date Next][Thread Prev][Thread Next][Date Index][Thread Index]

No subject



Failed to build rtems with networking support.
Did anyone faced with this problem?


***  /usr/src/rtems/build-mips64orion-rtems/c/src/lib/libnetworking (all)
cd libnetworking; gmake all


***  /usr/src/rtems/build-mips64orion-rtems/c/src/lib/libnetworking/kern
(all)
cd kern; gmake all
/usr/local/mips64orion/bin/mips64orion-rtems-gcc --pipe -DP4000 -DCPU_R4000 
-DP3_DIAG -D_R4000 -D__mips=3 -m4650 -G0 -Wall -ansi -fasm -g -B/usr/src/rte
ms/build-mips64orion-rtems/p4650/lib/ -specs
bsp_specs -qrtems -I/usr/src/rtems/build-mips64orion-rtems/p4650/lib/include
/networking -D_COMPILING_BSD_KERNEL_ -DKERNEL -DINET -DNFS -DDIAGNOSTIC -DBO
OTP_COMPAT -O4 -fomit-frame-pointer     -c -o o-p4650/kern_subr.o
../../../../../../rtems-4.0.0/c/src/lib/libnetworking/kern/kern_subr.c
Assembler messages:
FATAL: Can't create o-p4650/kern_subr.o: No such file or directory
In file included from
/usr/src/rtems/build-mips64orion-rtems/p4650/lib/include/rtems.h:39,
                 from
/usr/src/rtems/build-mips64orion-rtems/p4650/lib/include/networking/machine/
types.h:13,
                 from
/usr/local/mips64orion/mips64orionel-rtems/include/sys/types.h:13,
                 from
/usr/local/mips64orion/mips64orionel-rtems/include/sys/unistd.h:9,
                 from
/usr/local/mips64orion/mips64orionel-rtems/include/unistd.h:4,
                 from
/usr/src/rtems/build-mips64orion-rtems/p4650/lib/include/networking/sys/para
m.h:45,
                 from
../../../../../../rtems-4.0.0/c/src/lib/libnetworking/kern/kern_subr.c:42:
/usr/src/rtems/build-mips64orion-rtems/p4650/lib/include/rtems/rtems/status.
h:58: output pipe has been closed
cpp: output pipe has been closed
gmake[5]: *** [o-p4650/kern_subr.o] Error 1
gmake[4]: *** [all] Error 1
gmake[3]: *** [all] Error 1
gmake[2]: *** [all] Error 1
gmake[1]: *** [all] Error 1
gmake[1]: Leaving directory `/usr/src/rtems/build-mips64orion-rtems/c'
gmake: *** [all] Error 1