[Date Prev][Date Next][Thread Prev][Thread Next][Date Index][Thread Index]

troubles compiling rtems - the sequel part 1



Thanks for the "#define <errno.h>" patch, it works!

Now I have another problem (sorry for the flood but be sure I'm 
writing everything down)

I think it's a bit odd since
/rtems-build/c/src/exec/score/cpu/m68k/o-gen68360/bsp_specs.tmp
exists...

Thanks in advance

Geoffroy


$ make all
[...]
***  /rtems-build/c/src/exec/score/cpu/m68k (all)
cd m68k; make all
/rtems-build/gen68360/build-tools/install-if-change -m 444
o-gen68360/targopts.h
-tmp /rtems-build/gen68360/lib/include/rtems/score/targopts.h
cp
../../../../../../rtems-980219/c/src/lib/libbsp/m68k/gen68360/bsp_specs
o-gen
68360/bsp_specs.tmp
/rtems-build/gen68360/build-tools/install-if-change -m 444
o-gen68360/bsp_specs.
tmp /rtems-build/gen68360/lib/bsp_specs
can not read o-gen68360/bsp_specs.tmp
usage: install-if-change [ -vmV ] file [ file ... ]
dest-directory-or-file
        -v          -- verbose
        -V suffix   -- suffix to append to targets (before any . suffix)
                        eg: -V _g would change 'foo' to 'foo_g' and
                                               'libfoo.a' to
'libfoo_g.a'
        -m mode     -- mode for new file(s)
make[6]: *** [/rtems-build/gen68360/lib/bsp_specs] Error 1
make[5]: *** [all] Error 1
make[4]: *** [all] Error 1
make[3]: *** [all] Error 1
make[2]: *** [all] Error 1
make[1]: *** [all] Error 1
make: *** [all] Error 1
bash-2.01$




_________________________________________________________
DO YOU YAHOO!?
Get your free @yahoo.com address at http://mail.yahoo.com