[Date Prev][Date Next][Thread Prev][Thread Next][Date Index][Thread Index]

problems while installing Cygwin 32 patched version of rtems



Hi!

I'm using Cygwin 32 b19
I got the latest snapshot of RTEMS and installed Dave's patches.
But it doesn't work for me:

***  /rtemsbuild-340/c/build-tools/src (all)
cd src; make all
test -d o-gen68340 || /gnuwin/b19/H-i386-cygwin32/bin/mkdir -p -m 0755
o-gen6834
0
gcc -O     -I. -O   -Wall -c -o o-gen68340/cklength.o
../../../rtems-980618/c/bu
ild-tools/src/cklength.c
../../../rtems-980618/c/build-tools/src/cklength.c: In function `main':
../../../rtems-980618/c/build-tools/src/cklength.c:129: warning:
implicit declar
ation of function `getopt'
gcc -O     -o o-gen68340/cklength at EXEEXT@ o-gen68340/cklength at EXEEXT@.o
gcc: o-gen68340/cklength at EXEEXT@.o: No such file or directory
gcc: No input files
make[3]: *** [o-gen68340/cklength at EXEEXT@] Error 1
rm o-gen68340/cklength.o
make[2]: *** [all] Error 1
make[1]: *** [all] Error 1
make: *** [all] Error 1
bash-2.01$

Maybe I did stg wrong...

Another question (which has nothing to do with the previous one): 
does a RTEMS logo exist???

All the best,

Geoffroy


_________________________________________________________
DO YOU YAHOO!?
Get your free @yahoo.com address at http://mail.yahoo.com